Target
Potassium voltage-gated channel subfamily H member 2
Ligand
BDBM85747
Substrate
Meas. Tech.
Potassium Channel Assay
IC50
<1000±n/a nM
Citation
 Choong, ICCory, DGlenn, JSYang, W Methods and compositions of treating a flaviviridae family viral infection US Patent  US8975247 Publication Date 3/10/2015 
Target
Name:
Potassium voltage-gated channel subfamily H member 2
Synonyms:
1,3-beta-glucan synthase component GLS2 ERG Eag-related protein 1 Ether-a-go-go-related gene (HERG) Ether-a-go-go-related gene potassium channel 1 Ether-a-go-go-related gene potassium channel 1 (hERG1) Ether-a-go-go-related protein 1 H-ERG KCNH2 Potassium voltage-gated channel subfamily H member 2 (hERG) Voltage-gated potassium channel subunit Kv11.1 hERG Potassium Channel 1 | putative potassium channel subunit
Type:
Multi-pass membrane protein
Mol. Mass.:
126672.65
Organism:
Homo sapiens (Human)
Description:
Q12809
Residue:
1159
  
Inhibitor
Name:
BDBM85747
Synonyms:
CAS_442-52-4 NSC_2782 | clemizole
Type:
Small organic molecule
Emp. Form.:
C19H20ClN3
Mol. Mass.:
325.835
SMILES:
Clc1ccc(Cn2c(CN3CCCC3)nc3ccccc23)cc1
: