Target
Potassium voltage-gated channel subfamily H member 2
Ligand
BDBM149399
Substrate
Meas. Tech.
Potassium Channel Assay
IC50
>30000±n/a nM
Citation
 Choong, ICCory, DGlenn, JSYang, W Methods and compositions of treating a flaviviridae family viral infection US Patent  US8975247 Publication Date 3/10/2015 
Target
Name:
Potassium voltage-gated channel subfamily H member 2
Synonyms:
1,3-beta-glucan synthase component GLS2 ERG Eag-related protein 1 Ether-a-go-go-related gene (HERG) Ether-a-go-go-related gene potassium channel 1 Ether-a-go-go-related gene potassium channel 1 (hERG1) Ether-a-go-go-related protein 1 H-ERG KCNH2 Potassium voltage-gated channel subfamily H member 2 (hERG) Voltage-gated potassium channel subunit Kv11.1 hERG Potassium Channel 1 | putative potassium channel subunit
Type:
Multi-pass membrane protein
Mol. Mass.:
126672.65
Organism:
Homo sapiens (Human)
Description:
Q12809
Residue:
1159
  
Inhibitor
Name:
BDBM149399
Synonyms:
US8975247, EBP143
Type:
Small organic molecule
Emp. Form.:
C15H13ClN2O
Mol. Mass.:
272.73
SMILES:
OCc1nc2ccccc2n1Cc1ccc(Cl)cc1
: