Target
Epidermal growth factor receptor
Ligand
BDBM149416
Substrate
Meas. Tech.
Omnia Assay
pH
7.5±n/a
IC50
<1±n/a nM
Comments
extracted
Citation
 Lee, KNiu, DPetter, RCBaevsky, MFSingh, J Heterocyclic compounds and uses thereof US Patent  US8975249 Publication Date 3/10/2015 
Target
Name:
Epidermal growth factor receptor
Synonyms:
EGF Receptor Substrate EGFR_HUMAN ERBB1 Epidermal Growth Factor Receptor erbB-1 Epidermal growth factor receptor (EGFR) HER1 Proto-oncogene c-ErbB-1 Tyrosine-Protein Kinase ErbB-1
Type:
Receptor Kinase Domain
Mol. Mass.:
134279.59
Organism:
Homo sapiens (Human)
Description:
P00533
Residue:
1210
  
Inhibitor
Name:
BDBM149416
Synonyms:
US10434101, Compound I-17 US8975249, I-17
Type:
Small organic molecule
Emp. Form.:
C26H28F3N7O4S
Mol. Mass.:
591.605
SMILES:
COc1cc(ccc1Nc1ncc(c(Nc2cccc(NC(=O)C=C)c2)n1)C(F)(F)F)N1CCN(CC1)S(C)(=O)=O
: