Target
Serine/threonine-protein kinase pim-1
Ligand
BDBM149684
Substrate
Meas. Tech.
Trans-Phosphorylation Assay
pH
3±n/a
IC50
>10000±n/a nM
Comments
extracted
Citation
 Caldarelli, MAngiolini, MBeria, IBrasca, MGCasuscelli, FD'Alessio, RLombardi Borgia, A Tricyclic pyrrolo derivatives, process for their preparation and their use as kinase inhibitors US Patent  US8975267 Publication Date 3/10/2015 
Target
Name:
Serine/threonine-protein kinase pim-1
Synonyms:
PIM-1 Kinase PIM1_HUMAN Serine/threonine-protein kinase (PIM1) Serine/threonine-protein kinase PIM1 | Serine/threonine-protein kinase pim-1 (PIM1)
Type:
Protein
Mol. Mass.:
35681.82
Organism:
Homo sapiens (Human)
Description:
P11309
Residue:
313
  
Inhibitor
Name:
BDBM149684
Synonyms:
US8975267, 3
Type:
Small organic molecule
Emp. Form.:
C39H49N7O2
Mol. Mass.:
647.8521
SMILES:
CCc1cccc(CC)c1NC(=O)c1c(C)n(C)c-2c1CCc1cnc(Nc3ccc(cc3OC)N3CCC(CC3)N3CCCC3)nc-21
: