Target
Serine/threonine-protein kinase pim-1
Ligand
BDBM149687
Substrate
Meas. Tech.
Trans-Phosphorylation Assay
pH
3±n/a
IC50
133±n/a nM
Comments
extracted
Citation
 Caldarelli, MAngiolini, MBeria, IBrasca, MGCasuscelli, FD'Alessio, RLombardi Borgia, A Tricyclic pyrrolo derivatives, process for their preparation and their use as kinase inhibitors US Patent  US8975267 Publication Date 3/10/2015 
Target
Name:
Serine/threonine-protein kinase pim-1
Synonyms:
PIM-1 Kinase PIM1_HUMAN Serine/threonine-protein kinase (PIM1) Serine/threonine-protein kinase PIM1 | Serine/threonine-protein kinase pim-1 (PIM1)
Type:
Protein
Mol. Mass.:
35681.82
Organism:
Homo sapiens (Human)
Description:
P11309
Residue:
313
  
Inhibitor
Name:
BDBM149687
Synonyms:
US8975267, 25
Type:
Small organic molecule
Emp. Form.:
C14H16N4O2S
Mol. Mass.:
304.367
SMILES:
CSc1ncc2CCc3c(cn(CCO)c3-c2n1)C(N)=O
: