Target
Serine/threonine-protein kinase pim-1
Ligand
BDBM149694
Substrate
Meas. Tech.
Trans-Phosphorylation Assay
pH
3±n/a
IC50
13±n/a nM
Comments
extracted
Citation
 Caldarelli, MAngiolini, MBeria, IBrasca, MGCasuscelli, FD'Alessio, RLombardi Borgia, A Tricyclic pyrrolo derivatives, process for their preparation and their use as kinase inhibitors US Patent  US8975267 Publication Date 3/10/2015 
Target
Name:
Serine/threonine-protein kinase pim-1
Synonyms:
PIM-1 Kinase PIM1_HUMAN Serine/threonine-protein kinase (PIM1) Serine/threonine-protein kinase PIM1 | Serine/threonine-protein kinase pim-1 (PIM1)
Type:
Protein
Mol. Mass.:
35681.82
Organism:
Homo sapiens (Human)
Description:
P11309
Residue:
313
  
Inhibitor
Name:
BDBM149694
Synonyms:
US8975267, 36
Type:
Small organic molecule
Emp. Form.:
C12H10N4OS
Mol. Mass.:
258.299
SMILES:
CSc1ncc2ccc3c(c[nH]c3c2n1)C(N)=O
: