Target
Bromodomain-containing protein 3
Ligand
BDBM150062
Substrate
Meas. Tech.
TR-FRET In-Vitro Binding Assay
pH
7.5±n/a
Temperature
303.15±n/a K
IC50
<11±n/a nM
Comments
extracted
Citation
 Bordas, VCotesta, SGuagnano, VRueeger, HVaupel, A Pyrazolopyrrolidine derivatives and their use in the treatment of disease US Patent  US8975417 Publication Date 3/10/2015 
Target
Name:
Bromodomain-containing protein 3
Synonyms:
BRD3 Bromodomain and extra-terminal motif (BET) Bromodomain-containing protein 3 (BRD3) RING3-like protein | RING3L
Type:
Protein
Mol. Mass.:
79571.81
Organism:
Homo sapiens (Human)
Description:
Q15059
Residue:
726
  
Inhibitor
Name:
BDBM150062
Synonyms:
US8975417, 122
Type:
Small organic molecule
Emp. Form.:
C22H20ClN7O
Mol. Mass.:
433.894
SMILES:
Cc1nn(C2CC2)c2C(=O)N([C@@H](c12)c1ccc(Cl)cc1)c1cc(C)c2nnc(C)n2n1
: