Target
Translocator protein
Ligand
BDBM150167
Substrate
Meas. Tech.
Competitive Binding Assay
Temperature
303.15±n/a K
Ki
11.09±n/a nM
IC50
26.05±n/a nM
Comments
extracted
Citation
 Yang, RLi, YLi, YZhao, NYun, LQin, JFeng, ZZhang, Y 2-aryl imidazo[1,2-a]pyridine-3-acetamide derivatives, preparation methods and uses thereof US Patent  US8980887 Publication Date 3/17/2015 
Target
Name:
Translocator protein
Synonyms:
Benzodiazepine receptors; peripheral & central Mbr PBR Peripheral benzodiazepine receptor (PBR) TSPO_RAT | Tspo
Type:
Mitochondrion membrane protein
Mol. Mass.:
18945.84
Organism:
Rattus norvegicus (rat)
Description:
Competitive binding experiments were performed on rat kidney mitochondrial membranes.
Residue:
169
  
Inhibitor
Name:
BDBM150167
Synonyms:
US8980887, Compound 10
Type:
Small organic molecule
Emp. Form.:
C24H22Cl2N4O
Mol. Mass.:
453.364
SMILES:
CCN(Cc1ccncc1)C(=O)Cc1c(nc2cc(C)ccn12)-c1ccc(Cl)c(Cl)c1
: