Target
Uncharacterized protein
Ligand
BDBM50148641
Substrate
Meas. Tech.
Luminescent Kinase Assay
IC50
8.00±n/a nM
Citation
 Fan, EVan Voorhis, WCZhang, ZHuang, WOjo, KK 5-aminopyrazole-4-carboxamide inhibitors of CDPK1 from T. gondii and C. parvum US Patent  US9518026 Publication Date 12/13/2016 
Target
Name:
Uncharacterized protein
Synonyms:
Calmodulin-domain protein kinase (CDPK1)
Type:
Enzyme Catalytic Domain
Mol. Mass.:
60946.72
Organism:
Cryptosporidium parvum
Description:
Residue:
538
  
Inhibitor
Name:
BDBM50148641
Synonyms:
CHEMBL3770649 US9956214, Compound 1604
Type:
Small organic molecule
Emp. Form.:
C22H27N5O2
Mol. Mass.:
393.4821
SMILES:
CCOc1ccc2cc(cnc2c1)-c1nn(C2CCCCCC2)c(N)c1C(N)=O
: