Target
Uncharacterized protein
Ligand
BDBM50148646
Substrate
Meas. Tech.
Luminescent Kinase Assay
IC50
9.00±n/a nM
Citation
 Fan, EVan Voorhis, WCZhang, ZHuang, WOjo, KK 5-aminopyrazole-4-carboxamide inhibitors of CDPK1 from T. gondii and C. parvum US Patent  US9518026 Publication Date 12/13/2016 
Target
Name:
Uncharacterized protein
Synonyms:
Calmodulin-domain protein kinase (CDPK1)
Type:
Enzyme Catalytic Domain
Mol. Mass.:
60946.72
Organism:
Cryptosporidium parvum
Description:
Residue:
538
  
Inhibitor
Name:
BDBM50148646
Synonyms:
CHEMBL3770662 US9956214, Compound 1641
Type:
Small organic molecule
Emp. Form.:
C19H23N5O3
Mol. Mass.:
369.4176
SMILES:
CCOc1ccc2cc(cnc2c1)-c1nn(CC(C)(C)O)c(N)c1C(N)=O
: