Target
Uncharacterized protein
Ligand
BDBM50148725
Substrate
Meas. Tech.
Luminescent Kinase Assay
IC50
22.0±n/a nM
Citation
 Fan, EVan Voorhis, WCZhang, ZHuang, WOjo, KK 5-aminopyrazole-4-carboxamide inhibitors of CDPK1 from T. gondii and C. parvum US Patent  US9518026 Publication Date 12/13/2016 
Target
Name:
Uncharacterized protein
Synonyms:
Calmodulin-domain protein kinase (CDPK1)
Type:
Enzyme Catalytic Domain
Mol. Mass.:
60946.72
Organism:
Cryptosporidium parvum
Description:
Residue:
538
  
Inhibitor
Name:
BDBM50148725
Synonyms:
CHEMBL3769980 US9956214, Compound 1555
Type:
Small organic molecule
Emp. Form.:
C18H18F3N5O
Mol. Mass.:
377.3636
SMILES:
CC(C)(C)n1nc(c(C(N)=O)c1N)-c1cnc2cc(ccc2c1)C(F)(F)F
: