Target
Uncharacterized protein
Ligand
BDBM50148749
Substrate
Meas. Tech.
Luminescent Kinase Assay
IC50
9.00±n/a nM
Citation
 Fan, EVan Voorhis, WCZhang, ZHuang, WOjo, KK 5-aminopyrazole-4-carboxamide inhibitors of CDPK1 from T. gondii and C. parvum US Patent  US9518026 Publication Date 12/13/2016 
Target
Name:
Uncharacterized protein
Synonyms:
Calmodulin-domain protein kinase (CDPK1)
Type:
Enzyme Catalytic Domain
Mol. Mass.:
60946.72
Organism:
Cryptosporidium parvum
Description:
Residue:
538
  
Inhibitor
Name:
BDBM50148749
Synonyms:
CHEMBL3770313 US9956214, Compound 1586
Type:
Small organic molecule
Emp. Form.:
C20H23N5O2
Mol. Mass.:
365.4289
SMILES:
CC(C)(C)n1nc(c(C(N)=O)c1N)-c1cnc2cc(OC3CC3)ccc2c1
: