Target
Uncharacterized protein
Ligand
BDBM50200562
Substrate
Meas. Tech.
Luminescent Kinase Assay
IC50
13.0±n/a nM
Citation
 Fan, EVan Voorhis, WCZhang, ZHuang, WOjo, KK 5-aminopyrazole-4-carboxamide inhibitors of CDPK1 from T. gondii and C. parvum US Patent  US9518026 Publication Date 12/13/2016 
Target
Name:
Uncharacterized protein
Synonyms:
Calmodulin-domain protein kinase (CDPK1)
Type:
Enzyme Catalytic Domain
Mol. Mass.:
60946.72
Organism:
Cryptosporidium parvum
Description:
Residue:
538
  
Inhibitor
Name:
BDBM50200562
Synonyms:
CHEMBL3985876 US9956214, Compound 1645
Type:
Small organic molecule
Emp. Form.:
C22H27N5O3
Mol. Mass.:
409.4815
SMILES:
CC(C)(CO)Cn1nc(c(C(N)=O)c1N)-c1ccc2nc(OC3CCC3)ccc2c1
: