Target
Uncharacterized protein
Ligand
BDBM50148748
Substrate
Meas. Tech.
Luminescent Kinase Assay
IC50
89.0±n/a nM
Citation
 Fan, EVan Voorhis, WCZhang, ZHuang, WOjo, KK 5-aminopyrazole-4-carboxamide inhibitors of CDPK1 from T. gondii and C. parvum US Patent  US9518026 Publication Date 12/13/2016 
Target
Name:
Uncharacterized protein
Synonyms:
Calmodulin-domain protein kinase (CDPK1)
Type:
Enzyme Catalytic Domain
Mol. Mass.:
60946.72
Organism:
Cryptosporidium parvum
Description:
Residue:
538
  
Inhibitor
Name:
BDBM50148748
Synonyms:
CHEMBL3770200 US9956214, Compound 1588
Type:
Small organic molecule
Emp. Form.:
C21H27N5O2
Mol. Mass.:
381.4714
SMILES:
CC(C)COc1ccc2cc(cnc2c1)-c1nn(c(N)c1C(N)=O)C(C)(C)C
: