Target
Dipeptidyl peptidase 4
Ligand
BDBM150242
Substrate
Meas. Tech.
Fluorometric Assay
pH
7.5±n/a
IC50
14.3±n/a nM
Comments
extracted
Citation
 Hicks, JDBiftu, TChen, PQian, XWilkening, RR Substituted seven-membered heterocyclic compounds as dipeptidyl peptidase-iv inhibitors for the treatment of diabetes US Patent  US8980929 Publication Date 3/17/2015 
Target
Name:
Dipeptidyl peptidase 4
Synonyms:
ADABP Adenosine deaminase complexing protein 2 CD_antigen=CD26 DPP4 DPPIV Dipeptidyl peptidase 4 (DPP IV) Dipeptidyl peptidase 4 (DPP4) Dipeptidyl peptidase 4 membrane form Dipeptidyl peptidase IV Dipeptidyl peptidase IV (DDP-IV) Dipeptidyl peptidase IV membrane form Dipeptidyl peptidase-IV (DPP-4) T-cell activation antigen CD26 | TP103
Type:
Enzyme
Mol. Mass.:
88271.01
Organism:
Homo sapiens (Human)
Description:
P27487
Residue:
766
  
Inhibitor
Name:
BDBM150242
Synonyms:
US8980929, Example Compound 10
Type:
Small organic molecule
Emp. Form.:
C18H22F2N4O2S2
Mol. Mass.:
428.52
SMILES:
CS(=O)(=O)n1cc2CN(Cc2n1)[C@H]1CCS[C@@H]([C@@H](N)C1)c1cc(F)ccc1F
: