Target
Tyrosine-protein kinase JAK1
Ligand
BDBM281345
Substrate
Meas. Tech.
JAK Caliper Enzyme Assay at 1 mM ATP
pH
7.4±n/a
Temperature
298.15±n/a K
IC50
0.800±n/a nM
Comments
extracted
Citation
 Coe, JWDehnhardt, CMJones, PSabnis, YAStrohbach, JWWakenhut, FMWhitlock, GA Pyrazolopyridines and pyrazolopyrimidines US Patent  US9518052 Publication Date 12/13/2016 
Target
Name:
Tyrosine-protein kinase JAK1
Synonyms:
JAK-1 JAK1A JAK1_HUMAN Janus kinase 1 (JAK1) | Janus kinase 1 JAK1
Type:
Protein
Mol. Mass.:
133293.73
Organism:
Homo sapiens (Human)
Description:
P23458
Residue:
1154
  
Inhibitor
Name:
BDBM281345
Synonyms:
N-ethyl-N-[2-({[6-(2-ethyl-5-fluoro-4-hydroxyphenyl)-1H-pyrazolo[4,3-c]pyridin-4-yl]amino}methyl)phe-nyl]ethanesulfonamidehydrochloride | US10022376, Example 136
Type:
Small organic molecule
Emp. Form.:
C25H28FN5O3S
Mol. Mass.:
497.585
SMILES:
CCN(c1ccccc1CNc1nc(cc2[nH]ncc12)-c1cc(F)c(O)cc1CC)S(=O)(=O)CC
: