Target
Dipeptidyl peptidase 1
Ligand
BDBM150328
Substrate
Meas. Tech.
Inhibition Assay
Temperature
298.15±n/a K
IC50
2±n/a nM
Comments
extracted
Citation
 Anderskewitz, RBinder, FGrauert, MGrundl, MHaebel, PWOost, TPautsch, APeters, SVintonyak, V Substituted 2-Aza-bicyclo[2.2.1]heptane-3-carboxylic acid (benzyl-cyano-methyl)-amides inhibitors of Cathepsin C US Patent  US8987249 Publication Date 3/24/2015 
Target
Name:
Dipeptidyl peptidase 1
Synonyms:
CATC_HUMAN CTSC Cathepsin J Dipeptidyl peptidase 1 (DPPI) Dipeptidyl peptidase I (DPPI)
Type:
Enzyme
Mol. Mass.:
51857.28
Organism:
Homo sapiens (Human)
Description:
P53634
Residue:
463
  
Inhibitor
Name:
BDBM150328
Synonyms:
US10238633, Example 2 US9713606, 2
Type:
Small organic molecule
Emp. Form.:
C25H25FN4O2
Mol. Mass.:
432.49
SMILES:
CN1C(=O)Cc2ccc(cc12)-c1ccc(C[C@H](NC(=O)[C@H]2N[C@@H]3CC[C@H]2C3)C#N)c(F)c1
: