Target
Thiamine transporter ThiT
Ligand
BDBM150801
Substrate
Meas. Tech.
Intrinsic-Fluorescence Titration
Kd
266±131 nM
Citation
 Swier, LJMonjas, LGuskov, Ade Voogd, ARErkens, GBSlotboom, DJHirsch, AK Structure-based design of potent small-molecule binders to the S-component of the ECF transporter for thiamine. Chembiochem 16:819-26 (2015)  
Target
Name:
Thiamine transporter ThiT
Synonyms:
THIT_LACLM thiT
Type:
Protein
Mol. Mass.:
19919.46
Organism:
Lactococcus lactis (Firmicutes)
Description:
3RLB
Residue:
182
  
Inhibitor
Name:
BDBM150801
Synonyms:
(3-((4-Amino-2-methylpyrimidin-5-yl)methyl)phenyl)methanol (6)
Type:
Small organic molecule
Emp. Form.:
C13H15N3O
Mol. Mass.:
229.2777
SMILES:
Cc1ncc(Cc2cccc(CO)c2)c(N)n1
: