Target
Poly-beta-1,6-N-acetyl-D-glucosamine N-deacetylase
Ligand
BDBM150807
Substrate
Meas. Tech.
Fluorogenic ACC Substrate Assay
pH
7.5±n/a
Ki
>1.000e+6±n/a nM
Comments
extracted
Citation
 Ariyakumaran, RPokrovskaya, VLittle, DJHowell, PLNitz, M Direct Staudinger-Phosphonite Reaction Provides Methylphosphonamidates as Inhibitors of CE4 De-N-acetylases. Chembiochem 16:1350-6 (2015)  
Target
Name:
Poly-beta-1,6-N-acetyl-D-glucosamine N-deacetylase
Synonyms:
PGAB_ECOLI pgaB | ycdR
Type:
Protein
Mol. Mass.:
77407.78
Organism:
Escherichia coli (Enterobacteria)
Description:
P75906
Residue:
672
  
Inhibitor
Name:
BDBM150807
Synonyms:
Sodium N-methylphosphate-1,4-di-O-benzyl-beta-D-glucosamine (15c)
Type:
Small organic molecule
Emp. Form.:
C21H27NNaO7P
Mol. Mass.:
459.4051
SMILES:
[Na+].CP([O-])(=O)N[C@H]1C(O)[C@H](OCc2ccccc2)C(CO)O[C@H]1OCc1ccccc1
: