Target
Peptidoglycan-N-acetylglucosamine deacetylase
Ligand
BDBM150806
Substrate
Meas. Tech.
Fluorescamine Assay
pH
7±n/a
Temperature
298.15±n/a K
Ki
7.20e+5± 1.50e+5 nM
Comments
extracted
Citation
 Ariyakumaran, RPokrovskaya, VLittle, DJHowell, PLNitz, M Direct Staudinger-Phosphonite Reaction Provides Methylphosphonamidates as Inhibitors of CE4 De-N-acetylases. Chembiochem 16:1350-6 (2015)  
Target
Name:
Peptidoglycan-N-acetylglucosamine deacetylase
Synonyms:
PGDA_STRR6 pgdA
Type:
Protein
Mol. Mass.:
52665.99
Organism:
Streptococcus pneumoniae (Firmicutes)
Description:
Q8DP63
Residue:
463
  
Inhibitor
Name:
BDBM150806
Synonyms:
Sodium N-methylphosphate-1,3-di-O-methyl-4-O-benzyl-beta-D-glucosamine (15b)
Type:
Small organic molecule
Emp. Form.:
C16H25NNaO7P
Mol. Mass.:
397.3357
SMILES:
[Na+].CO[C@@H]1OC(CO)[C@@H](OCc2ccccc2)C(OC)[C@@H]1NP(C)([O-])=O
: