Target
Acetylcholinesterase
Ligand
BDBM152523
Substrate
Meas. Tech.
In Vitro AChE Inhibition Assay
pH
8±n/a
Ki
9.90e+3± 1.33e+3 nM
IC50
1.029e+4± 7e+1 nM
Km
19300±1130 nM
Comments
extracted
Citation
 Piplani, PDanta, CC Design and synthesis of newer potential 4-(N-acetylamino)phenol derived piperazine derivatives as potential cognition enhancers. Bioorg Chem 60:64-73 (2015)  
Target
Name:
Acetylcholinesterase
Synonyms:
ACES_MOUSE Acetylcholinesterase (mouse AChE) Ache
Type:
Enzyme
Mol. Mass.:
68165.65
Organism:
Mus musculus (mouse)
Description:
Residue:
614
  
Inhibitor
Name:
BDBM152523
Synonyms:
N-(4-(3-(4-(3-chlorophenyl)piperazin-1-yl)propoxy)phenyl)acetamide (2e)
Type:
Small organic molecule
Emp. Form.:
C21H26ClN3O2
Mol. Mass.:
387.903
SMILES:
CC(=O)Nc1ccc(OCCCN2CCN(CC2)c2cccc(Cl)c2)cc1
: