Target
Seed linoleate 13S-lipoxygenase-1
Ligand
BDBM152751
Substrate
Meas. Tech.
15LO Inhibition Assay
pH
7±n/a
Temperature
298.15±n/a K
IC50
>5.00e+5±n/a nM
Comments
extracted
Citation
 Asghari, TBakavoli, MRahimizadeh, MEshghi, HSaberi, SKarimian, AHadizadeh, FGhandadi, M Synthesis and evaluation of a new series of 3,5-bis((5-bromo-6-methyl-2-t-aminopyrimidin-4-yl)thio)-4H-1,2,4-triazol-4-amines and their cyclized products 'pyrimidinylthio pyrimidotriazolothiadiazines' as 15- lipo-oxygenase inhibitors. Chem Biol Drug Des 85:216-24 (2015)  
Target
Name:
Seed linoleate 13S-lipoxygenase-1
Synonyms:
15-LOX 15-lipo-oxygenase (SLO) L-1 LOX1.1 Lipoxygenase (LOX) Lipoxygenase-1 | Seed lipoxygenase-1
Type:
Enzyme
Mol. Mass.:
94365.66
Organism:
Glycine max (soybean)
Description:
Residue:
839
  
Inhibitor
Name:
BDBM152751
Synonyms:
3-((5-bromo-6-methyl-2-(4-methylpiperidin-1-yl)pyrimidin-4-yl)thio)-6-methyl-8-(4-methylpiperidin-1-yl)-5H-pyrimido[5,4-e][1,2,4]triazolo[3,4-b][1,3,4]thiadiazine (5c)
Type:
Small organic molecule
Emp. Form.:
C25H34N10S2
Mol. Mass.:
538.734
SMILES:
CC1CCN(CC1)c1nc(C)c(C)c(Sc2nnc3Sc4nc(nc(C)c4Nn23)N2CCC(C)CC2)n1
: