Target
Cyclin-dependent kinase 2
Ligand
BDBM154577
Substrate
Meas. Tech.
EMSA
Temperature
576.3±0 K
IC50
>1.0e+4±n/a nM
Citation
 Alexander, LTMöbitz, HDrueckes, PSavitsky, PFedorov, OElkins, JMDeane, CMCowan-Jacob, SWKnapp, S Type II Inhibitors Targeting CDK2. ACS Chem Biol 10:2116-25 (2015)  
Target
Name:
Cyclin-dependent kinase 2
Synonyms:
CDK2 CDK2_HUMAN Cell division protein kinase 2 Protein cereblon/Cyclin-dependent kinase 2 | p33 protein kinase
Type:
Enzyme Subunit
Mol. Mass.:
33938.17
Organism:
Homo sapiens (Human)
Description:
P24941
Residue:
298
  
Inhibitor
Name:
BDBM154577
Synonyms:
K03859 (2)
Type:
Small organic molecule
Emp. Form.:
C30H29F3N6O3
Mol. Mass.:
578.5849
SMILES:
CN1CCN(Cc2ccc(NC(=O)c3cccc4cc(Oc5cc(NC(C)=O)ncn5)ccc34)cc2C(F)(F)F)CC1
: