Target
Amyloid-beta precursor protein
Ligand
BDBM155124
Substrate
Meas. Tech.
Release Assay
Temperature
310.15±n/a K
IC50
7.4±n/a nM
Comments
extracted
Citation
 Karlstrom, SSoderman, PRakos, LOhberg, LKolmodin, KSandberg, L Cyclohexane-1,2′-indene-1′,2″-imidazol compounds and their use as BACE inhibitors US Patent  US9000183 Publication Date 4/7/2015 
Target
Name:
Amyloid-beta precursor protein
Synonyms:
A4 ABPP AICD-50 AICD-59 AID(57) APP Alzheimer disease amyloid protein Amyloid beta Protein Amyloid beta protein Abeta(1-42) Amyloid intracellular domain 57 Amyloid protein (Abeta42b) Beta amyloid A4 protein Beta-APP42 Beta-amyloid protein 42 C83 CVAP Gamma Secretase Gamma-CTF(57) Gamma-secretase Gamma-secretase C-terminal fragment 57 P3(40) PN-II Protease nexin-II S-APP-beta Soluble APP-beta | beta-Amyloid Precursor Protein (APP)
Type:
Single-pass type I membrane protein
Mol. Mass.:
86890.41
Organism:
Homo sapiens (Human)
Description:
P05067
Residue:
770
  
Inhibitor
Name:
BDBM155124
Synonyms:
US9000183, 9 Isomer 1
Type:
Small organic molecule
Emp. Form.:
C25H24F2N4O
Mol. Mass.:
434.4811
SMILES:
CO[C@H]1CC[C@@]2(Cc3cc(F)c(cc3[C@@]22N=C(C)C(N)=N2)-c2cc(F)cc(c2)C#N)CC1
: