Target
5-hydroxytryptamine receptor 2C
Ligand
BDBM155935
Substrate
Meas. Tech.
Receptor Binding Assay
IC50
1156.3±n/a nM
Citation
 Zhang, GChen, YXu, XLiu, XZhao, SLiu, BYu, MQiu, Y Alicyclic[c] benzopyrone derivatives and uses thereof US Patent  US9018213 Publication Date 4/28/2015 
Target
Name:
5-hydroxytryptamine receptor 2C
Synonyms:
5-HT2C 5-hydroxytryptamine receptor 2C (5HT2c) 5ht1c Htr2c Serotonin receptor 2a and 2c (5HT2A and 5HT2C)
Type:
Enzyme
Mol. Mass.:
51935.10
Organism:
Rattus norvegicus (Rat)
Description:
P08909
Residue:
460
  
Inhibitor
Name:
BDBM155935
Synonyms:
US9018213, 5
Type:
Small organic molecule
Emp. Form.:
C27H27FN2O4
Mol. Mass.:
462.5127
SMILES:
Fc1ccc2c(noc2c1)C1CCN(CCCOc2ccc3c4CCCc4c(=O)oc3c2)CC1
: