Target
Sigma non-opioid intracellular receptor 1
Ligand
BDBM287090
Substrate
Meas. Tech.
Binding Assay
pH
7.4±n/a
Ki
73.1±n/a nM
Comments
extracted
Citation
 Cuberes-Altisent, MRCorbera-Arjona, JDiaz-Fernandez, JLAlmansa-Rosales, C Pyrazolo[3,4-d]pyrimidine compounds, their preparation and use as sigma ligands US Patent  US9567338 Publication Date 2/14/2017 
Target
Name:
Sigma non-opioid intracellular receptor 1
Synonyms:
OPRS1 SIGMAR1 Sigma non-opioid intracellular receptor 1 Sigma1-receptor Sterol isomerase-like protein
Type:
Protein
Mol. Mass.:
25307.17
Organism:
Cavia porcellus (Guinea pig)
Description:
Q60492
Residue:
223
  
Inhibitor
Name:
BDBM287090
Synonyms:
N-(1-(2-(Piperidin-1- yl)ethyl)-1H-pyrazolo[3,4- d]pyrimidin-4- yl)cyclohexanecarboxamide hydrochloride | US9567338, 6
Type:
Small organic molecule
Emp. Form.:
C19H28N6O
Mol. Mass.:
356.4652
SMILES:
O=C(Nc1ncnc2n(CCN3CCCCC3)ncc12)C1CCCCC1
: