Target
Sigma non-opioid intracellular receptor 1
Ligand
BDBM287091
Substrate
Meas. Tech.
Binding Assay
pH
7.4±n/a
Ki
292±n/a nM
Comments
extracted
Citation
 Cuberes-Altisent, MRCorbera-Arjona, JDiaz-Fernandez, JLAlmansa-Rosales, C Pyrazolo[3,4-d]pyrimidine compounds, their preparation and use as sigma ligands US Patent  US9567338 Publication Date 2/14/2017 
Target
Name:
Sigma non-opioid intracellular receptor 1
Synonyms:
OPRS1 SIGMAR1 Sigma non-opioid intracellular receptor 1 Sigma1-receptor Sterol isomerase-like protein
Type:
Protein
Mol. Mass.:
25307.17
Organism:
Cavia porcellus (Guinea pig)
Description:
Q60492
Residue:
223
  
Inhibitor
Name:
BDBM287091
Synonyms:
2,4-Dichloro-N-(1-(2- (piperidin-1-yl)ethyl)-1H- pyrazolo[3,4-d]pyrimidin-4- yl)benzamide hydrochloride | US9567338, 7
Type:
Small organic molecule
Emp. Form.:
C19H20Cl2N6O
Mol. Mass.:
419.308
SMILES:
Clc1ccc(C(=O)Nc2ncnc3n(CCN4CCCCC4)ncc23)c(Cl)c1
: