Target
Sigma non-opioid intracellular receptor 1
Ligand
BDBM287098
Substrate
Meas. Tech.
Binding Assay
pH
7.4±n/a
Ki
244±n/a nM
Comments
extracted
Citation
 Cuberes-Altisent, MRCorbera-Arjona, JDiaz-Fernandez, JLAlmansa-Rosales, C Pyrazolo[3,4-d]pyrimidine compounds, their preparation and use as sigma ligands US Patent  US9567338 Publication Date 2/14/2017 
Target
Name:
Sigma non-opioid intracellular receptor 1
Synonyms:
OPRS1 SIGMAR1 Sigma non-opioid intracellular receptor 1 Sigma1-receptor Sterol isomerase-like protein
Type:
Protein
Mol. Mass.:
25307.17
Organism:
Cavia porcellus (Guinea pig)
Description:
Q60492
Residue:
223
  
Inhibitor
Name:
BDBM287098
Synonyms:
N-(1-(2- (Diisopropylamino)ethyl)- 1H-pyrazolo[3,4- d]pyrimidin-4- yl)cyclohexanecarboxamide maleate | US9567338, 16
Type:
Small organic molecule
Emp. Form.:
C20H32N6O
Mol. Mass.:
372.5077
SMILES:
CC(C)N(CCn1ncc2c(NC(=O)C3CCCCC3)ncnc12)C(C)C
: