Target
Sigma non-opioid intracellular receptor 1
Ligand
BDBM287111
Substrate
Meas. Tech.
Binding Assay
pH
7.4±n/a
Ki
11.1±n/a nM
Comments
extracted
Citation
 Cuberes-Altisent, MRCorbera-Arjona, JDiaz-Fernandez, JLAlmansa-Rosales, C Pyrazolo[3,4-d]pyrimidine compounds, their preparation and use as sigma ligands US Patent  US9567338 Publication Date 2/14/2017 
Target
Name:
Sigma non-opioid intracellular receptor 1
Synonyms:
OPRS1 SIGMAR1 Sigma non-opioid intracellular receptor 1 Sigma1-receptor Sterol isomerase-like protein
Type:
Protein
Mol. Mass.:
25307.17
Organism:
Cavia porcellus (Guinea pig)
Description:
Q60492
Residue:
223
  
Inhibitor
Name:
BDBM287111
Synonyms:
N-(1-(2-(azepan-1- yl)ethyl)-1H-pyrazolo[3,4- d]pyrimidin-4-yl)-2,2,3,3- tetramethylcyclopropane- carboxamide citrate | US9567338, 35
Type:
Small organic molecule
Emp. Form.:
C21H32N6O
Mol. Mass.:
384.5184
SMILES:
CC1(C)C(C(=O)Nc2ncnc3n(CCN4CCCCCC4)ncc23)C1(C)C
: