Target
Sigma non-opioid intracellular receptor 1
Ligand
BDBM287116
Substrate
Meas. Tech.
Binding Assay
pH
7.4±n/a
Ki
32.7±n/a nM
Comments
extracted
Citation
 Cuberes-Altisent, MRCorbera-Arjona, JDiaz-Fernandez, JLAlmansa-Rosales, C Pyrazolo[3,4-d]pyrimidine compounds, their preparation and use as sigma ligands US Patent  US9567338 Publication Date 2/14/2017 
Target
Name:
Sigma non-opioid intracellular receptor 1
Synonyms:
OPRS1 SIGMAR1 Sigma non-opioid intracellular receptor 1 Sigma1-receptor Sterol isomerase-like protein
Type:
Protein
Mol. Mass.:
25307.17
Organism:
Cavia porcellus (Guinea pig)
Description:
Q60492
Residue:
223
  
Inhibitor
Name:
BDBM287116
Synonyms:
N-(1-(3-(azepan-1- yl)propyl)-1H-pyrazolo[3,4- d]pyrimidin-4-yl)pivalamide maleate | US9567338, 42
Type:
Small organic molecule
Emp. Form.:
C19H30N6O
Mol. Mass.:
358.4811
SMILES:
CC(C)(C)C(=O)Nc1ncnc2n(CCCN3CCCCCC3)ncc12
: