Target
Sigma non-opioid intracellular receptor 1
Ligand
BDBM287119
Substrate
Meas. Tech.
Binding Assay
pH
7.4±n/a
Ki
21.2±n/a nM
Comments
extracted
Citation
 Cuberes-Altisent, MRCorbera-Arjona, JDiaz-Fernandez, JLAlmansa-Rosales, C Pyrazolo[3,4-d]pyrimidine compounds, their preparation and use as sigma ligands US Patent  US9567338 Publication Date 2/14/2017 
Target
Name:
Sigma non-opioid intracellular receptor 1
Synonyms:
OPRS1 SIGMAR1 Sigma non-opioid intracellular receptor 1 Sigma1-receptor Sterol isomerase-like protein
Type:
Protein
Mol. Mass.:
25307.17
Organism:
Cavia porcellus (Guinea pig)
Description:
Q60492
Residue:
223
  
Inhibitor
Name:
BDBM287119
Synonyms:
1-(1-(2-(Azepan-1- yl)ethyl)-1H- pyrazolo[3,4- d]pyrimidin-4-yl)-3- cyclopentylurea hydrochloride | US9567338, 49
Type:
Small organic molecule
Emp. Form.:
C19H29N7O
Mol. Mass.:
371.4799
SMILES:
O=C(NC1CCCC1)Nc1ncnc2n(CCN3CCCCCC3)ncc12
: