Target
Sigma non-opioid intracellular receptor 1
Ligand
BDBM287124
Substrate
Meas. Tech.
Binding Assay
pH
7.4±n/a
Ki
142±n/a nM
Comments
extracted
Citation
 Cuberes-Altisent, MRCorbera-Arjona, JDiaz-Fernandez, JLAlmansa-Rosales, C Pyrazolo[3,4-d]pyrimidine compounds, their preparation and use as sigma ligands US Patent  US9567338 Publication Date 2/14/2017 
Target
Name:
Sigma non-opioid intracellular receptor 1
Synonyms:
OPRS1 SIGMAR1 Sigma non-opioid intracellular receptor 1 Sigma1-receptor Sterol isomerase-like protein
Type:
Protein
Mol. Mass.:
25307.17
Organism:
Cavia porcellus (Guinea pig)
Description:
Q60492
Residue:
223
  
Inhibitor
Name:
BDBM287124
Synonyms:
1-(2,4-Dichlorophenyl)- 3-(1-(2-(piperidin-1- yl)ethyl)-1H- pyrazolo[3,4- d]pyrimidin-4-yl)urea hydrochloride | US9567338, 60
Type:
Small organic molecule
Emp. Form.:
C19H21Cl2N7O
Mol. Mass.:
434.322
SMILES:
Clc1ccc(NC(=O)Nc2ncnc3n(CCN4CCCCC4)ncc23)c(Cl)c1
: