Target
Sigma non-opioid intracellular receptor 1
Ligand
BDBM287134
Substrate
Meas. Tech.
Binding Assay
pH
7.4±n/a
Ki
212±n/a nM
Comments
extracted
Citation
 Cuberes-Altisent, MRCorbera-Arjona, JDiaz-Fernandez, JLAlmansa-Rosales, C Pyrazolo[3,4-d]pyrimidine compounds, their preparation and use as sigma ligands US Patent  US9567338 Publication Date 2/14/2017 
Target
Name:
Sigma non-opioid intracellular receptor 1
Synonyms:
OPRS1 SIGMAR1 Sigma non-opioid intracellular receptor 1 Sigma1-receptor Sterol isomerase-like protein
Type:
Protein
Mol. Mass.:
25307.17
Organism:
Cavia porcellus (Guinea pig)
Description:
Q60492
Residue:
223
  
Inhibitor
Name:
BDBM287134
Synonyms:
1-(1-(2-(4-tert- butylpiperidin-1- yl)ethyl)-1H- pyrazolo[3,4- d]pyrimidin-4-yl)-3- propylurea | US9567338, 74
Type:
Small organic molecule
Emp. Form.:
C20H33N7O
Mol. Mass.:
387.5223
SMILES:
CCCNC(=O)Nc1ncnc2n(CCN3CCC(CC3)C(C)(C)C)ncc12
: