Target
Sigma non-opioid intracellular receptor 1
Ligand
BDBM287139
Substrate
Meas. Tech.
Binding Assay
pH
7.4±n/a
Ki
21.8±n/a nM
Comments
extracted
Citation
 Cuberes-Altisent, MRCorbera-Arjona, JDiaz-Fernandez, JLAlmansa-Rosales, C Pyrazolo[3,4-d]pyrimidine compounds, their preparation and use as sigma ligands US Patent  US9567338 Publication Date 2/14/2017 
Target
Name:
Sigma non-opioid intracellular receptor 1
Synonyms:
OPRS1 SIGMAR1 Sigma non-opioid intracellular receptor 1 Sigma1-receptor Sterol isomerase-like protein
Type:
Protein
Mol. Mass.:
25307.17
Organism:
Cavia porcellus (Guinea pig)
Description:
Q60492
Residue:
223
  
Inhibitor
Name:
BDBM287139
Synonyms:
1-(1-(2-(azepan- 1-yl)ethyl)-1H- pyrazolo[3,4- d]pyrimidin-4-yl)-3- cyclopropylthiourea hydrochloride | US9567338, 79
Type:
Small organic molecule
Emp. Form.:
C17H25N7S
Mol. Mass.:
359.492
SMILES:
S=C(NC1CC1)Nc1ncnc2n(CCN3CCCCCC3)ncc12
: