Target
Sigma non-opioid intracellular receptor 1
Ligand
BDBM287144
Substrate
Meas. Tech.
Binding Assay
pH
7.4±n/a
Ki
329±n/a nM
Comments
extracted
Citation
 Cuberes-Altisent, MRCorbera-Arjona, JDiaz-Fernandez, JLAlmansa-Rosales, C Pyrazolo[3,4-d]pyrimidine compounds, their preparation and use as sigma ligands US Patent  US9567338 Publication Date 2/14/2017 
Target
Name:
Sigma non-opioid intracellular receptor 1
Synonyms:
OPRS1 SIGMAR1 Sigma non-opioid intracellular receptor 1 Sigma1-receptor Sterol isomerase-like protein
Type:
Protein
Mol. Mass.:
25307.17
Organism:
Cavia porcellus (Guinea pig)
Description:
Q60492
Residue:
223
  
Inhibitor
Name:
BDBM287144
Synonyms:
N-(1-(3-(4- methylpiperazin-1- yl)propyl)-1H- pyrazolo[3,4-d]pyrimidin- 4-yl)pivalamide | US9567338, 86
Type:
Small organic molecule
Emp. Form.:
C18H29N7O
Mol. Mass.:
359.4692
SMILES:
CN1CCN(CCCn2ncc3c(NC(=O)C(C)(C)C)ncnc23)CC1
: