Target
Sigma non-opioid intracellular receptor 1
Ligand
BDBM287148
Substrate
Meas. Tech.
Binding Assay
pH
7.4±n/a
Ki
221±n/a nM
Comments
extracted
Citation
 Cuberes-Altisent, MRCorbera-Arjona, JDiaz-Fernandez, JLAlmansa-Rosales, C Pyrazolo[3,4-d]pyrimidine compounds, their preparation and use as sigma ligands US Patent  US9567338 Publication Date 2/14/2017 
Target
Name:
Sigma non-opioid intracellular receptor 1
Synonyms:
OPRS1 SIGMAR1 Sigma non-opioid intracellular receptor 1 Sigma1-receptor Sterol isomerase-like protein
Type:
Protein
Mol. Mass.:
25307.17
Organism:
Cavia porcellus (Guinea pig)
Description:
Q60492
Residue:
223
  
Inhibitor
Name:
BDBM287148
Synonyms:
N-(1-(2-(azepan-1-yl)ethyl)-1H-pyrazolo[3,4-d]pyrimidin-4-yl)-N-methylacetamide | US9567338, 101
Type:
Small organic molecule
Emp. Form.:
C13H18ClN5
Mol. Mass.:
279.769
SMILES:
Clc1ncnc2n(CCN3CCCCCC3)ncc12
: