Target
Xanthine dehydrogenase/oxidase
Ligand
BDBM157875
Substrate
Meas. Tech.
Inhibition Assay
Temperature
298.15±n/a K
IC50
2.5±n/a nM
Comments
extracted
Citation
 Shimizu, KTakigawa, YFujikura, HIizuka, MHiratochi, MKikuchi, N 5-membered nitrogen containing heterocyclic derivatives and pharmaceutical compositions comprising the same US Patent  US9023882 Publication Date 5/5/2015 
Target
Name:
Xanthine dehydrogenase/oxidase
Synonyms:
XDH Xanthine dehydrogenase Xanthine oxidase (XO)
Type:
Protein
Mol. Mass.:
146809.00
Organism:
Bos taurus (Bovine)
Description:
P80457
Residue:
1332
  
Inhibitor
Name:
BDBM157875
Synonyms:
US9023882, 148
Type:
Small organic molecule
Emp. Form.:
C18H12N2O3
Mol. Mass.:
304.2995
SMILES:
OC(=O)c1ccc(cc1)-n1cc(C#N)c(c1)-c1ccc(O)cc1
: