Target
Xanthine dehydrogenase/oxidase
Ligand
BDBM157877
Substrate
Meas. Tech.
Inhibition Assay
Temperature
298.15±n/a K
IC50
5±n/a nM
Comments
extracted
Citation
 Shimizu, KTakigawa, YFujikura, HIizuka, MHiratochi, MKikuchi, N 5-membered nitrogen containing heterocyclic derivatives and pharmaceutical compositions comprising the same US Patent  US9023882 Publication Date 5/5/2015 
Target
Name:
Xanthine dehydrogenase/oxidase
Synonyms:
XDH Xanthine dehydrogenase Xanthine oxidase (XO)
Type:
Protein
Mol. Mass.:
146809.00
Organism:
Bos taurus (Bovine)
Description:
P80457
Residue:
1332
  
Inhibitor
Name:
BDBM157877
Synonyms:
US9023882, 150
Type:
Small organic molecule
Emp. Form.:
C21H18N2O4
Mol. Mass.:
362.3786
SMILES:
OCCCOc1cccc(c1)-c1cn(cc1C#N)-c1ccc(cc1)C(O)=O
: