Target
Xanthine dehydrogenase/oxidase
Ligand
BDBM157922
Substrate
Meas. Tech.
Inhibition Assay
Temperature
298.15±n/a K
IC50
5.2±n/a nM
Comments
extracted
Citation
 Shimizu, KTakigawa, YFujikura, HIizuka, MHiratochi, MKikuchi, N 5-membered nitrogen containing heterocyclic derivatives and pharmaceutical compositions comprising the same US Patent  US9023882 Publication Date 5/5/2015 
Target
Name:
Xanthine dehydrogenase/oxidase
Synonyms:
XDH Xanthine dehydrogenase Xanthine oxidase (XO)
Type:
Protein
Mol. Mass.:
146809.00
Organism:
Bos taurus (Bovine)
Description:
P80457
Residue:
1332
  
Inhibitor
Name:
BDBM157922
Synonyms:
US9023882, 208
Type:
Small organic molecule
Emp. Form.:
C18H11FN2O2
Mol. Mass.:
306.2905
SMILES:
OC(=O)c1ccc(cc1F)-n1cc(C#N)c(c1)-c1ccccc1
: