Target
Xanthine dehydrogenase/oxidase
Ligand
BDBM157948
Substrate
Meas. Tech.
Inhibition Assay
Temperature
298.15±n/a K
IC50
3.6±n/a nM
Comments
extracted
Citation
 Shimizu, KTakigawa, YFujikura, HIizuka, MHiratochi, MKikuchi, N 5-membered nitrogen containing heterocyclic derivatives and pharmaceutical compositions comprising the same US Patent  US9023882 Publication Date 5/5/2015 
Target
Name:
Xanthine dehydrogenase/oxidase
Synonyms:
XDH Xanthine dehydrogenase Xanthine oxidase (XO)
Type:
Protein
Mol. Mass.:
146809.00
Organism:
Bos taurus (Bovine)
Description:
P80457
Residue:
1332
  
Inhibitor
Name:
BDBM157948
Synonyms:
US9023882, 238
Type:
Small organic molecule
Emp. Form.:
C15H14N2O2
Mol. Mass.:
254.2839
SMILES:
CCCc1cn(cc1C#N)-c1ccc(cc1)C(O)=O
: