Target
Xanthine dehydrogenase/oxidase
Ligand
BDBM157950
Substrate
Meas. Tech.
Inhibition Assay
Temperature
298.15±n/a K
IC50
3.3±n/a nM
Comments
extracted
Citation
 Shimizu, KTakigawa, YFujikura, HIizuka, MHiratochi, MKikuchi, N 5-membered nitrogen containing heterocyclic derivatives and pharmaceutical compositions comprising the same US Patent  US9023882 Publication Date 5/5/2015 
Target
Name:
Xanthine dehydrogenase/oxidase
Synonyms:
XDH Xanthine dehydrogenase Xanthine oxidase (XO)
Type:
Protein
Mol. Mass.:
146809.00
Organism:
Bos taurus (Bovine)
Description:
P80457
Residue:
1332
  
Inhibitor
Name:
BDBM157950
Synonyms:
US9023882, 240
Type:
Small organic molecule
Emp. Form.:
C16H16N2O2
Mol. Mass.:
268.3104
SMILES:
CCCCc1cn(cc1C#N)-c1ccc(cc1)C(O)=O
: