Target
Xanthine dehydrogenase/oxidase
Ligand
BDBM157992
Substrate
Meas. Tech.
Inhibition Assay
Temperature
298.15±n/a K
IC50
3.9±n/a nM
Comments
extracted
Citation
 Shimizu, KTakigawa, YFujikura, HIizuka, MHiratochi, MKikuchi, N 5-membered nitrogen containing heterocyclic derivatives and pharmaceutical compositions comprising the same US Patent  US9023882 Publication Date 5/5/2015 
Target
Name:
Xanthine dehydrogenase/oxidase
Synonyms:
XDH Xanthine dehydrogenase Xanthine oxidase (XO)
Type:
Protein
Mol. Mass.:
146809.00
Organism:
Bos taurus (Bovine)
Description:
P80457
Residue:
1332
  
Inhibitor
Name:
BDBM157992
Synonyms:
US9023882, 285
Type:
Small organic molecule
Emp. Form.:
C20H16N2O5
Mol. Mass.:
364.3514
SMILES:
COc1ccc(cc1OC)-c1cn(cc1C#N)-c1ccc(C(O)=O)c(O)c1
: