Target
Xanthine dehydrogenase/oxidase
Ligand
BDBM158034
Substrate
Meas. Tech.
Inhibition Assay
Temperature
298.15±n/a K
IC50
5.3±n/a nM
Comments
extracted
Citation
 Shimizu, KTakigawa, YFujikura, HIizuka, MHiratochi, MKikuchi, N 5-membered nitrogen containing heterocyclic derivatives and pharmaceutical compositions comprising the same US Patent  US9023882 Publication Date 5/5/2015 
Target
Name:
Xanthine dehydrogenase/oxidase
Synonyms:
XDH Xanthine dehydrogenase Xanthine oxidase (XO)
Type:
Protein
Mol. Mass.:
146809.00
Organism:
Bos taurus (Bovine)
Description:
P80457
Residue:
1332
  
Inhibitor
Name:
BDBM158034
Synonyms:
US9023882, 331
Type:
Small organic molecule
Emp. Form.:
C19H11N3O3
Mol. Mass.:
329.3089
SMILES:
OC(=O)c1ccc(cc1O)-n1cc(C#N)c(c1)-c1ccc(cc1)C#N
: