Target
Xanthine dehydrogenase/oxidase
Ligand
BDBM158054
Substrate
Meas. Tech.
Inhibition Assay
Temperature
298.15±n/a K
IC50
3.2±n/a nM
Comments
extracted
Citation
 Shimizu, KTakigawa, YFujikura, HIizuka, MHiratochi, MKikuchi, N 5-membered nitrogen containing heterocyclic derivatives and pharmaceutical compositions comprising the same US Patent  US9023882 Publication Date 5/5/2015 
Target
Name:
Xanthine dehydrogenase/oxidase
Synonyms:
XDH Xanthine dehydrogenase Xanthine oxidase (XO)
Type:
Protein
Mol. Mass.:
146809.00
Organism:
Bos taurus (Bovine)
Description:
P80457
Residue:
1332
  
Inhibitor
Name:
BDBM158054
Synonyms:
US9023882, 352
Type:
Small organic molecule
Emp. Form.:
C15H15N3O3
Mol. Mass.:
285.2979
SMILES:
CC(C)(C)c1nn(cc1C#N)-c1ccc(C(O)=O)c(O)c1
: