Target
D(1A) dopamine receptor
Ligand
BDBM160914
Substrate
Meas. Tech.
Competition Binding Assay
Ki
40.6±n/a nM
Citation
 Brodney, MADavoren, JEDounay, ABEfremov, IVGray, DLGreen, MEHenderson, JLLee, CMente, SRO'Neil, SVRogers, BNZhang, L Heteroaromatic compounds and their use as dopamine D1 ligands US Patent  US9107923 Publication Date 8/18/2015 
Target
Name:
D(1A) dopamine receptor
Synonyms:
DA D1 receptor DRD1 Dopamine D1 receptor Dopamine D1A
Type:
Enzyme
Mol. Mass.:
49303.43
Organism:
Homo sapiens (Human)
Description:
P21728
Residue:
446
  
Inhibitor
Name:
BDBM160914
Synonyms:
US10093655, Example 4 US9107923, 3 | US9107923, 4
Type:
Small organic molecule
Emp. Form.:
C18H15ClFN3O3
Mol. Mass.:
375.781
SMILES:
Cc1cc(Oc2ncc(F)cc2Cl)ccc1-c1c(C)c(=O)[nH]c(=O)n1C
: