Target
D(1A) dopamine receptor
Ligand
BDBM160925
Substrate
Meas. Tech.
Competition Binding Assay
Ki
54.7±n/a nM
Citation
 Brodney, MADavoren, JEDounay, ABEfremov, IVGray, DLGreen, MEHenderson, JLLee, CMente, SRO'Neil, SVRogers, BNZhang, L Heteroaromatic compounds and their use as dopamine D1 ligands US Patent  US9107923 Publication Date 8/18/2015 
Target
Name:
D(1A) dopamine receptor
Synonyms:
DA D1 receptor DRD1 Dopamine D1 receptor Dopamine D1A
Type:
Enzyme
Mol. Mass.:
49303.43
Organism:
Homo sapiens (Human)
Description:
P21728
Residue:
446
  
Inhibitor
Name:
BDBM160925
Synonyms:
US11014909, Example 15 US9107923, 15
Type:
Small organic molecule
Emp. Form.:
C19H17F2N3O3
Mol. Mass.:
373.3534
SMILES:
Cc1cc(Oc2ncccc2C(F)F)ccc1-c1c(C)c(=O)[nH]c(=O)n1C
: