Target
D(1A) dopamine receptor
Ligand
BDBM160903
Substrate
Meas. Tech.
Competition Binding Assay
Ki
43.4±n/a nM
Citation
 Brodney, MADavoren, JEDounay, ABEfremov, IVGray, DLGreen, MEHenderson, JLLee, CMente, SRO'Neil, SVRogers, BNZhang, L Heteroaromatic compounds and their use as dopamine D1 ligands US Patent  US9107923 Publication Date 8/18/2015 
Target
Name:
D(1A) dopamine receptor
Synonyms:
DA D1 receptor DRD1 Dopamine D1 receptor Dopamine D1A
Type:
Enzyme
Mol. Mass.:
49303.43
Organism:
Homo sapiens (Human)
Description:
P21728
Residue:
446
  
Inhibitor
Name:
BDBM160903
Synonyms:
US10093655, Example 73 US9107923, 73
Type:
Small organic molecule
Emp. Form.:
C19H18ClN3O2
Mol. Mass.:
355.818
SMILES:
Cc1ccnc(Oc2ccc(c(C)c2)-c2c(C)ncc(=O)n2C)c1Cl
: