Target
Sodium channel protein type 10 subunit alpha
Ligand
BDBM160945
Substrate
Meas. Tech.
Electrophysiology Assay
IC50
37±n/a nM
Citation
 Hadida-Ruah, SSAnderson, CArumugam, VAsgian, ILBear, BRTermin, APJohnson, JP Amides as modulators of sodium channels US Patent  US9108903 Publication Date 8/18/2015 
Target
Name:
Sodium channel protein type 10 subunit alpha
Synonyms:
SCNAA_RAT Sns Sodium channel protein type X alpha subunit | Voltage-gated sodium channel subunit alpha Nav1.8
Type:
Enzyme
Mol. Mass.:
219724.17
Organism:
Rattus norvegicus (Rat)
Description:
Q62968
Residue:
1956
  
Inhibitor
Name:
BDBM160945
Synonyms:
US9108903, 10
Type:
Small organic molecule
Emp. Form.:
C23H14F7NO5
Mol. Mass.:
517.3498
SMILES:
COc1cc(F)ccc1Oc1cc(cc(c1C(=O)Nc1ccc(cc1)C(O)=O)C(F)(F)F)C(F)(F)F
: