Target
Sodium channel protein type 10 subunit alpha
Ligand
BDBM160953
Substrate
Meas. Tech.
Electrophysiology Assay
IC50
11±n/a nM
Citation
 Hadida-Ruah, SSAnderson, CArumugam, VAsgian, ILBear, BRTermin, APJohnson, JP Amides as modulators of sodium channels US Patent  US9108903 Publication Date 8/18/2015 
Target
Name:
Sodium channel protein type 10 subunit alpha
Synonyms:
SCNAA_RAT Sns Sodium channel protein type X alpha subunit | Voltage-gated sodium channel subunit alpha Nav1.8
Type:
Enzyme
Mol. Mass.:
219724.17
Organism:
Rattus norvegicus (Rat)
Description:
Q62968
Residue:
1956
  
Inhibitor
Name:
BDBM160953
Synonyms:
US9108903, 18
Type:
Small organic molecule
Emp. Form.:
C21H14Cl3NO5
Mol. Mass.:
466.699
SMILES:
COc1cc(Cl)ccc1Oc1cc(Cl)c(Cl)cc1C(=O)Nc1ccc(cc1)C(O)=O
: