Target
Sodium channel protein type 10 subunit alpha
Ligand
BDBM160961
Substrate
Meas. Tech.
Electrophysiology Assay
IC50
24±n/a nM
Citation
 Hadida-Ruah, SSAnderson, CArumugam, VAsgian, ILBear, BRTermin, APJohnson, JP Amides as modulators of sodium channels US Patent  US9108903 Publication Date 8/18/2015 
Target
Name:
Sodium channel protein type 10 subunit alpha
Synonyms:
SCNAA_RAT Sns Sodium channel protein type X alpha subunit | Voltage-gated sodium channel subunit alpha Nav1.8
Type:
Enzyme
Mol. Mass.:
219724.17
Organism:
Rattus norvegicus (Rat)
Description:
Q62968
Residue:
1956
  
Inhibitor
Name:
BDBM160961
Synonyms:
US9108903, 26
Type:
Small organic molecule
Emp. Form.:
C21H12Cl2F3NO5
Mol. Mass.:
486.225
SMILES:
OC(=O)c1ccc(NC(=O)c2cc(Cl)c(Cl)cc2Oc2ccc(OC(F)(F)F)cc2)cc1
: